{"text_format":"1","workbook":"xlsx","n_sheets":7,"sheets":["Como Usar","Informações","Lanc_BC1","Calc","DRE Sintetico","DRE Analitico","BaseDados"],"not_rendered":{"charts":0,"images":7,"macros":1,"external_links":0,"defined_names":4,"comments":0,"pivot_tables":0},"unopened":[],"bounds":{"document_bytes":16777216,"sheet_cells":100000,"rows_first":2000,"rows_last":500,"rows_between":2000,"halvings":0,"cell_chars":16384,"cell_head_chars":4096},"cells_cut":0,"cells_raw":0,"read":"whole","date_system":"1900"}

{"sheet":"Como Usar","index":0,"n_rows":35,"n_cols":2,"rows_kept":35,"cut":false,"hidden":false,"merged":[[1,2,11,2]]}
[]
[]
[null,"A Sua Planilha de Controle financeiro!"]
[null,"Ao iniciar á utilização da planilha, leia as intruções abaixo:"]
[]
[null,"1. Preencha a aba Informações, ela é importante para preenchimento automatico de outros campos."]
[null,"2. A planilha possui abas de lançamentos, que servirão de base para o seu controle financeiro."]
[null,"3. Preencha os lançamentos com as informações solicitadas, pois são fundamentais para a Análise Financeira."]
[null,"4. Distribua as receitas e despesas nas  \"CATEGORIAS\"  já cadastradas, estas foram analisadas por nossos contadores. "]
[null,"5. No campo \"Data de pagamento/recebimento\", inserir a data exata de entrada ou saída de valores das contas bancárias."]
{"$rows_left_out":26}
{"sheet":"Informações","index":1,"n_rows":19,"n_cols":7,"rows_kept":19,"cut":false,"hidden":false,"merged":[[3,5,3,6],[3,1,3,3],[4,1,4,3],[4,5,4,6],[1,2,1,6],[1,0,1,1]]}
[]
["Nome da Empresa :",null,"CMTO Clinica"]
[]
[null,"para o controle dos seus Bancos",null,null,null,"para o controle dos seus fornecedores"]
[null,"Cadastro de Bancos",null,null,null,"Cadastro de Fornecedor"]
[null,"Data do Inicio","Banco","Saldo Inicial",null,"Nome","CNPJ / CPF"]
[null,"2022-12-25","Caixinha",1114.73,null,"Correios","23.456.7890/0001-23"]
[null,"2021-01-01","Inter",1000,null,"Mercado Livre","34.456.789/0001-90"]
[null,"2021-02-11","Bradesco",1000]
[null,"2022-07-15","Itau",2200]
{"$rows_left_out":10}
{"sheet":"Lanc_BC1","index":2,"n_rows":44,"n_cols":12,"rows_kept":44,"cut":false,"hidden":false,"merged":[[0,8,0,9],[0,10,0,11]]}
[]
["Resultado","Saldo Inicial","Entradas","Saídas","Saldo"]
[{"$f":"C3+D3","v":9338.7100000000028},{"$f":"IF(Calc!Q2=1,Calc!R2,IFERROR(VLOOKUP(Calc!Q2,Calc!O2:R32,4,FALSE),0))","v":5314.73},{"$f":"SUMPRODUCT(SUBTOTAL(9,OFFSET(K5,ROW(Tabela2[Valor Original])-ROW(K5),0)),(Tabela2[Valor Original]>=0)+0)","v":29849.390000000003},{"$f":"SUMPRODUCT(SUBTOTAL(9,OFFSET(K5,ROW(Tabela2[Valor Original])-ROW(K5),0)),(Tabela2[Valor Original]<0)+0)","v":-20510.68},{"$f":"A3+B3","v":14653.440000000002}]
["Data Pgto          Recbto","Fornecedor                                            Cliente","CNPJ/CPF","Nº Doc","Descrição","Categoria","Banco","Valor Pago      Recebido","Valor Juros","Valor Desconto","Valor Original","Saldo"]
["2021-08-09","Mercado Livre",{"$f":"IF(B5=\"\",\"\",IFERROR(VLOOKUP(B5,Informações!$F$7:$G$1048576,2,0),\"Verificar Se Há Cadastro\"))","v":"34.456.789/0001-90"},null,"Pagto. Mercado Livre","Marketing e publicidade","Caixinha",9948.4699999999993,0,0,{"$f":"IF(H5=\"\",\"-\",H5-I5+J5)","v":9948.4699999999993},{"$f":"IF(K5=\"-\",\"-\",K5+L4)","v":{"$error":"#VALUE!"}}]
["2021-08-09","Imovelweb",{"$f":"IF(B6=\"\",\"\",IFERROR(VLOOKUP(B6,Informações!$F$7:$G$1048576,2,0),\"Verificar Se Há Cadastro\"))","v":"Verificar Se Há Cadastro"},null,"Pagto. Imovelweb","Marketing e publicidade","Caixinha",-308,0,0,{"$f":"IF(H6=\"\",\"-\",H6-I6+J6)","v":-308},{"$f":"IF(K6=\"-\",\"-\",K6+L5)","v":{"$error":"#VALUE!"}}]
["2021-08-09","Pricila ( Nazaré casa 2 )",{"$f":"IF(B7=\"\",\"\",IFERROR(VLOOKUP(B7,Informações!$F$7:$G$1048576,2,0),\"Verificar Se Há Cadastro\"))","v":"Verificar Se Há Cadastro"},null,"aluguel casa 2 Nazaré ","Repasses","Caixinha",-596.9,0,0,{"$f":"IF(H7=\"\",\"-\",H7-I7+J7)","v":-596.9},{"$f":"IF(K7=\"-\",\"-\",K7+L6)","v":{"$error":"#VALUE!"}}]
["2021-08-09","Solvção",{"$f":"IF(B8=\"\",\"\",IFERROR(VLOOKUP(B8,Informações!$F$7:$G$1048576,2,0),\"Verificar Se Há Cadastro\"))","v":"Verificar Se Há Cadastro"},null,"Pagto. Solvção","Contabilidade","Caixinha",-1246,0,0,{"$f":"IF(H8=\"\",\"-\",H8-I8+J8)","v":-1246},{"$f":"IF(K8=\"-\",\"-\",K8+L7)","v":{"$error":"#VALUE!"}}]
["2021-08-11","Edisson Luiz Stella",{"$f":"IF(B9=\"\",\"\",IFERROR(VLOOKUP(B9,Informações!$F$7:$G$1048576,2,0),\"Verificar Se Há Cadastro\"))","v":"Verificar Se Há Cadastro"},null,"Repasse aluguel 07.2021  R. Nazaré E. Santo,7","Repasses","Caixinha",-1246,0,0,{"$f":"IF(H9=\"\",\"-\",H9-I9+J9)","v":-1246},{"$f":"IF(K9=\"-\",\"-\",K9+L8)","v":{"$error":"#VALUE!"}}]
["2021-08-11","Sandra ",{"$f":"IF(B10=\"\",\"\",IFERROR(VLOOKUP(B10,Informações!$F$7:$G$1048576,2,0),\"Verificar Se Há Cadastro\"))","v":"Verificar Se Há Cadastro"},null,"ADM Comissão sandra","Prestação de Serviço","Caixinha",-1246,0,0,{"$f":"IF(H10=\"\",\"-\",H10-I10+J10)","v":-1246},{"$f":"IF(K10=\"-\",\"-\",K10+L9)","v":{"$error":"#VALUE!"}}]
{"$rows_left_out":35}
{"sheet":"Calc","index":3,"n_rows":38,"n_cols":29,"rows_kept":38,"cut":false,"hidden":false,"merged":[]}
[null,null,null,null,null,null,null,{"$f":"SUM(H2:H59)","v":3114.73},null,null,null,null,null,null,null,null,null,{"$f":"COUNTA(P:P)","v":5},null,null,null,null,null,null,null,null,null,"Lista categoria","Todos"]
[null,"Inter",null,{"$f":"COUNTA(B:B)","v":37},null,null,"Inter",{"$f":"IFERROR(VLOOKUP(G2,Informações!$C$7:$D$20,2,FALSE()),0)","v":1000},{"$f":"COUNTA(G:G)","v":3},null,null,null,null,null,{"$f":"O1+1","v":1},"Total",1,{"$f":"SUM(R3:R30)","v":5314.73},null,null,null,null,null,null,null,null,null,"Todos"]
[null,"Inter",null,null,null,null,"Caixinha",{"$f":"IFERROR(VLOOKUP(G3,Informações!$C$7:$D$20,2,FALSE()),0)","v":1114.73},null,null,null,null,null,null,{"$f":"O2+1","v":2},"Caixinha",{"$f":"VLOOKUP(Q2,O2:P25,2,FALSE)","v":"Total"},{"$f":"IFERROR(VLOOKUP(P3,Informações!$C$7:$D$20,2,FALSE),0)","v":1114.73},null,null,null,null,null,null,null,null,null,"Contabilidade"]
[null,"Inter",null,null,null,null,"Bradesco",{"$f":"IFERROR(VLOOKUP(G4,Informações!$C$7:$D$20,2,FALSE()),0)","v":1000},null,null,null,null,null,null,3,"Inter",null,{"$f":"IFERROR(VLOOKUP(P4,Informações!$C$7:$D$20,2,FALSE),0)","v":1000},null,null,null,null,null,null,null,null,null,"Custo de serviços"]
[null,"Inter",null,null,null,null,null,null,null,null,null,null,null,null,4,"Bradesco",null,{"$f":"IFERROR(VLOOKUP(P5,Informações!$C$7:$D$20,2,FALSE),0)","v":1000},null,null,null,null,null,null,null,null,null,"DAS"]
[null,"Inter",null,null,null,null,null,null,null,null,null,null,null,null,5,"Itau",null,{"$f":"IFERROR(VLOOKUP(P6,Informações!$C$7:$D$20,2,FALSE),0)","v":2200},null,null,null,null,null,null,null,null,null,"Despesas bancárias"]
[null,"Inter",null,null,null,null,null,null,null,null,null,null,null,null,null,null,null,{"$f":"IFERROR(VLOOKUP(P7,Informações!$C$7:$D$20,2,FALSE),0)","v":0},null,null,null,null,null,null,null,null,null,"Locação"]
[null,"Inter",null,null,null,null,null,null,null,null,null,null,null,null,null,null,null,{"$f":"IFERROR(VLOOKUP(P8,Informações!$C$7:$D$20,2,FALSE),0)","v":0},null,null,null,null,null,null,null,null,null,"Marketing e publicidade"]
[null,"Inter",null,null,null,null,null,null,null,null,null,null,null,null,null,null,null,{"$f":"IFERROR(VLOOKUP(P9,Informações!$C$7:$D$20,2,FALSE),0)","v":0},null,null,null,null,null,null,null,null,null,"Premiação e gratificações"]
[null,"Inter",null,null,null,null,null,null,null,null,null,null,null,null,null,null,null,{"$f":"IFERROR(VLOOKUP(P10,Informações!$C$7:$D$20,2,FALSE),0)","v":0},null,null,null,null,null,null,null,null,null,"Prestação de Serviço"]
{"$rows_left_out":29}
{"sheet":"DRE Sintetico","index":4,"n_rows":36,"n_cols":13,"rows_kept":36,"cut":false,"hidden":false,"merged":[[35,0,35,6],[1,0,1,13],[2,7,2,8],[2,4,2,6]]}
[]
[{"$f":"Informações!C2","v":"CMTO Clinica"}]
[null,null,null,null,"Resumo do ano",null,null,2022]
[null,1,2,"3",4,5,"6",7,8,"9",10,11,"12"]
[null,{"$f":"DATE($H$3,B4,1)","v":"2022-01-01"},{"$f":"DATE($H$3,C4,1)","v":"2022-02-01"},"2022-03-01","2022-04-01","2022-05-01","2022-06-01","2022-07-01","2022-08-01","2022-09-01","2022-10-01","2022-11-01","2022-12-01"]
[]
["RESUMO"]
["Receitas",{"$f":"SUMIFS(Tabela2[Valor Original],Tabela2[Data Pgto          Recbto],\">=\"&'DRE Sintetico'!B5,Tabela2[Data Pgto          Recbto],\"<=\"&EOMONTH('DRE Sintetico'!B5,0),Tabela2[Valor Original],\">=0\")","v":9950.4599999999991},{"$f":"SUMIFS(Tabela2[Valor Original],Tabela2[Data Pgto          Recbto],\">=\"&'DRE Sintetico'!C5,Tabela2[Data Pgto          Recbto],\"<=\"&EOMONTH('DRE Sintetico'!C5,0),Tabela2[Valor Original],\">=0\")","v":9948.4699999999993},{"$f":"SUMIFS(Tabela2[Valor Original],Tabela2[Data Pgto          Recbto],\">=\"&'DRE Sintetico'!D5,Tabela2[Data Pgto          Recbto],\"<=\"&EOMONTH('DRE Sintetico'!D5,0),Tabela2[Valor Original],\">=0\")","v":0},{"$f":"SUMIFS(Tabela2[Valor Original],Tabela2[Data Pgto          Recbto],\">=\"&'DRE Sintetico'!E5,Tabela2[Data Pgto          Recbto],\"<=\"&EOMONTH('DRE Sintetico'!E5,0),Tabela2[Valor Original],\">=0\")","v":1.99},{"$f":"SUMIFS(Tabela2[Valor Original],Tabela2[Data Pgto          Recbto],\">=\"&'DRE Sintetico'!F5,Tabela2[Data Pgto          Recbto],\"<=\"&EOMONTH('DRE Sintetico'!F5,0),Tabela2[Valor Original],\">=0\")","v":0},{"$f":"SUMIFS(Tabela2[Valor Original],Tabela2[Data Pgto          Recbto],\">=\"&'DRE Sintetico'!G5,Tabela2[Data Pgto          Recbto],\"<=\"&EOMONTH('DRE Sintetico'!G5,0),Tabela2[Valor Original],\">=0\")","v":0},{"$f":"SUMIFS(Tabela2[Valor Original],Tabela2[Data Pgto          Recbto],\">=\"&'DRE Sintetico'!H5,Tabela2[Data Pgto          Recbto],\"<=\"&EOMONTH('DRE Sintetico'!H5,0),Tabela2[Valor Original],\">=0\")","v":0},{"$f":"SUMIFS(Tabela2[Valor Original],Tabela2[Data Pgto          Recbto],\">=\"&'DRE Sintetico'!I5,Tabela2[Data Pgto          Recbto],\"<=\"&EOMONTH('DRE Sintetico'!I5,0),Tabela2[Valor Original],\">=0\")","v":0},{"$f":"SUMIFS(Tabela2[Valor Original],Tabela2[Data Pgto          Recbto],\">=\"&'DRE Sintetico'!J5,Tabela2[Data Pgto          Recbto],\"<=\"&EOMONTH('DRE Sintetico'!J5,0),Tabela2[Valor Original],\">=0\")","v":0},{"$f":"SUMIFS(Tabela2[Valor Original],Tabela2[Data Pgto          Recbto],\">=\"&'DRE Sintetico'!K5,Tabela2[Data Pgto          Recbto],\"<=\"&EOMONTH('DRE Sintetico'!K5,0),Tabela2[Valor Original],\">=0\")","v":0},{"$f":"SUMIFS(Tabela2[Valor Original],Tabela2[Data Pgto          Recbto],\">=\"&'DRE Sintetico'!L5,Tabela2[Data Pgto          Recbto],\"<=\"&EOMONTH('DRE Sintetico'!L5,0),Tabela2[Valor Original],\">=0\")","v":0},{"$f":"SUMIFS(Tabela2[Valor Original],Tabela2[Data Pgto          Recbto],\">=\"&'DRE Sintetico'!M5,Tabela2[Data Pgto          Recbto],\"<=\"&EOMONTH('DRE Sintetico'!M5,0),Tabela2[Valor Original],\">=0\")","v":0}]
["Despesas",{"$f":"SUMIFS(Tabela2[Valor Original],Tabela2[Data Pgto          Recbto],\">=\"&'DRE Sintetico'!B5,Tabela2[Data Pgto          Recbto],\"<=\"&EOMONTH('DRE Sintetico'!B5,0),Tabela2[Valor Original],\"<=0\")","v":-7770.8899999999994},{"$f":"SUMIFS(Tabela2[Valor Original],Tabela2[Data Pgto          Recbto],\">=\"&'DRE Sintetico'!C5,Tabela2[Data Pgto          Recbto],\"<=\"&EOMONTH('DRE Sintetico'!C5,0),Tabela2[Valor Original],\"<=0\")","v":-3396.9},{"$f":"SUMIFS(Tabela2[Valor Original],Tabela2[Data Pgto          Recbto],\">=\"&'DRE Sintetico'!D5,Tabela2[Data Pgto          Recbto],\"<=\"&EOMONTH('DRE Sintetico'!D5,0),Tabela2[Valor Original],\"<=0\")","v":-2818},{"$f":"SUMIFS(Tabela2[Valor Original],Tabela2[Data Pgto          Recbto],\">=\"&'DRE Sintetico'!E5,Tabela2[Data Pgto          Recbto],\"<=\"&EOMONTH('DRE Sintetico'!E5,0),Tabela2[Valor Original],\"<=0\")","v":-1555.99},{"$f":"SUMIFS(Tabela2[Valor Original],Tabela2[Data Pgto          Recbto],\">=\"&'DRE Sintetico'!F5,Tabela2[Data Pgto          Recbto],\"<=\"&EOMONTH('DRE Sintetico'!F5,0),Tabela2[Valor Original],\"<=0\")","v":0},{"$f":"SUMIFS(Tabela2[Valor Original],Tabela2[Data Pgto          Recbto],\">=\"&'DRE Sintetico'!G5,Tabela2[Data Pgto          Recbto],\"<=\"&EOMONTH('DRE Sintetico'!G5,0),Tabela2[Valor Original],\"<=0\")","v":0},{"$f":"SUMIFS(Tabela2[Valor Original],Tabela2[Data Pgto          Recbto],\">=\"&'DRE Sintetico'!H5,Tabela2[Data Pgto          Recbto],\"<=\"&EOMONTH('DRE Sintetico'!H5,0),Tabela2[Valor Original],\"<=0\")","v":0},{"$f":"SUMIFS(Tabela2[Valor Original],Tabela2[Data Pgto          Recbto],\">=\"&'DRE Sintetico'!I5,Tabela2[Data Pgto          Recbto],\"<=\"&EOMONTH('DRE Sintetico'!I5,0),Tabela2[Valor Original],\"<=0\")","v":0},{"$f":"SUMIFS(Tabela2[Valor Original],Tabela2[Data Pgto          Recbto],\">=\"&'DRE Sintetico'!J5,Tabela2[Data Pgto          Recbto],\"<=\"&EOMONTH('DRE Sintetico'!J5,0),Tabela2[Valor Original],\"<=0\")","v":0},{"$f":"SUMIFS(Tabela2[Valor Original],Tabela2[Data Pgto          Recbto],\">=\"&'DRE Sintetico'!K5,Tabela2[Data Pgto          Recbto],\"<=\"&EOMONTH('DRE Sintetico'!K5,0),Tabela2[Valor Original],\"<=0\")","v":0},{"$f":"SUMIFS(Tabela2[Valor Original],Tabela2[Data Pgto          Recbto],\">=\"&'DRE Sintetico'!L5,Tabela2[Data Pgto          Recbto],\"<=\"&EOMONTH('DRE Sintetico'!L5,0),Tabela2[Valor Original],\"<=0\")","v":0},{"$f":"SUMIFS(Tabela2[Valor Original],Tabela2[Data Pgto          Recbto],\">=\"&'DRE Sintetico'!M5,Tabela2[Data Pgto          Recbto],\"<=\"&EOMONTH('DRE Sintetico'!M5,0),Tabela2[Valor Original],\"<=0\")","v":0}]
["Rendimentos",{"$f":"SUM(B8:B9)","v":2179.5699999999997},{"$f":"SUM(C8:C9)","v":6551.57},-2818,-1554,0,0,0,0,0,0,{"$f":"SUM(L8:L9)","v":0},{"$f":"SUM(M8:M9)","v":0}]
{"$rows_left_out":27}
{"sheet":"DRE Analitico","index":5,"n_rows":165,"n_cols":16,"rows_kept":165,"cut":false,"hidden":false,"merged":[[1,0,1,13],[2,8,2,9],[6,0,6,1],[22,0,22,1],[11,0,11,1],[2,2,2,7],[32,0,32,1],[46,0,46,1],[52,0,52,1],[70,0,70,1],[82,0,82,1],[103,0,103,1],[110,0,110,1],[115,0,115,1],[118,0,118,1],[133,0,133,1],[139,0,139,1],[163,0,163,1],[157,0,157,1],[153,0,153,1],[149,0,149,1],[146,0,146,1]]}
[]
[{"$f":"Informações!C2","v":"CMTO Clinica"}]
[null,null,"DEMOSTRATIVO DE RESULTADO DO EXERCICIO",null,null,null,null,null,2022]
[null,null,1,2,3,4,5,6,7,8,9,10,11,12]
[null,null,{"$f":"DATE($I$3,C4,1)","v":"2022-01-01"},{"$f":"DATE($I$3,D4,1)","v":"2022-02-01"},"2022-03-01","2022-04-01","2022-05-01","2022-06-01","2022-07-01","2022-08-01","2022-09-01","2022-10-01","2022-11-01","2022-12-01","2022-01-01","Total"]
["    "]
["RECEBIMENTOS",null,{"$f":"SUM(C8:C10)","v":6840.4699999999993},9948.4699999999993,0,0,0,0,0,0,0,0,0,0,{"$error":"#REF!"},{"$f":"SUM(P8:P10)","v":16788.939999999999}]
[{"$f":"IF(P8<>0,P8,\"\")","v":9640.4699999999993},"Vendas",{"$f":"SUMIFS(Lanc_BC1!$H:$H,Lanc_BC1!$A:$A,\">=\"&C$5,Lanc_BC1!$A:$A,\"<\"&D$5,Lanc_BC1!$F:$F,\"=\"&$B8)","v":-308},{"$f":"SUMIFS(Lanc_BC1!$H:$H,Lanc_BC1!$A:$A,\">=\"&D$5,Lanc_BC1!$A:$A,\"<\"&E$5,Lanc_BC1!$F:$F,\"=\"&$B8)","v":9948.4699999999993},{"$f":"SUMIFS(Lanc_BC1!$H:$H,Lanc_BC1!$A:$A,\">=\"&E$5,Lanc_BC1!$A:$A,\"<\"&F$5,Lanc_BC1!$F:$F,\"=\"&$B8)","v":0},{"$f":"SUMIFS(Lanc_BC1!$H:$H,Lanc_BC1!$A:$A,\">=\"&F$5,Lanc_BC1!$A:$A,\"<\"&G$5,Lanc_BC1!$F:$F,\"=\"&$B8)","v":0},{"$f":"SUMIFS(Lanc_BC1!$H:$H,Lanc_BC1!$A:$A,\">=\"&G$5,Lanc_BC1!$A:$A,\"<\"&H$5,Lanc_BC1!$F:$F,\"=\"&$B8)","v":0},{"$f":"SUMIFS(Lanc_BC1!$H:$H,Lanc_BC1!$A:$A,\">=\"&H$5,Lanc_BC1!$A:$A,\"<\"&I$5,Lanc_BC1!$F:$F,\"=\"&$B8)","v":0},{"$f":"SUMIFS(Lanc_BC1!$H:$H,Lanc_BC1!$A:$A,\">=\"&I$5,Lanc_BC1!$A:$A,\"<\"&J$5,Lanc_BC1!$F:$F,\"=\"&$B8)","v":0},{"$f":"SUMIFS(Lanc_BC1!$H:$H,Lanc_BC1!$A:$A,\">=\"&J$5,Lanc_BC1!$A:$A,\"<\"&K$5,Lanc_BC1!$F:$F,\"=\"&$B8)","v":0},{"$f":"SUMIFS(Lanc_BC1!$H:$H,Lanc_BC1!$A:$A,\">=\"&K$5,Lanc_BC1!$A:$A,\"<\"&L$5,Lanc_BC1!$F:$F,\"=\"&$B8)","v":0},{"$f":"SUMIFS(Lanc_BC1!$H:$H,Lanc_BC1!$A:$A,\">=\"&L$5,Lanc_BC1!$A:$A,\"<\"&M$5,Lanc_BC1!$F:$F,\"=\"&$B8)","v":0},{"$f":"SUMIFS(Lanc_BC1!$H:$H,Lanc_BC1!$A:$A,\">=\"&M$5,Lanc_BC1!$A:$A,\"<\"&N$5,Lanc_BC1!$F:$F,\"=\"&$B8)","v":0},{"$f":"SUMIFS(Lanc_BC1!$H:$H,Lanc_BC1!$A:$A,\">=\"&N$5,Lanc_BC1!$A:$A,\"<\"&O$5,Lanc_BC1!$F:$F,\"=\"&$B8)","v":0},{"$f":"SUMIFS(#REF!,#REF!,\">=\"&O$5,#REF!,\"<\"&P$5,#REF!,\"=\"&$B8)","v":{"$error":"#REF!"}},{"$f":"SUM(C8:N8)","v":9640.4699999999993}]
[{"$f":"IF(P9<>0,P9,\"\")","v":9640.4699999999993},"Serviços",{"$f":"SUMIFS(Lanc_BC1!$H:$H,Lanc_BC1!$A:$A,\">=\"&C$5,Lanc_BC1!$A:$A,\"<\"&D$5,Lanc_BC1!$F:$F,\"=\"&$B9)","v":9640.4699999999993},{"$f":"SUMIFS(Lanc_BC1!$H:$H,Lanc_BC1!$A:$A,\">=\"&D$5,Lanc_BC1!$A:$A,\"<\"&E$5,Lanc_BC1!$F:$F,\"=\"&$B9)","v":0},{"$f":"SUMIFS(Lanc_BC1!$H:$H,Lanc_BC1!$A:$A,\">=\"&E$5,Lanc_BC1!$A:$A,\"<\"&F$5,Lanc_BC1!$F:$F,\"=\"&$B9)","v":0},{"$f":"SUMIFS(Lanc_BC1!$H:$H,Lanc_BC1!$A:$A,\">=\"&F$5,Lanc_BC1!$A:$A,\"<\"&G$5,Lanc_BC1!$F:$F,\"=\"&$B9)","v":0},{"$f":"SUMIFS(Lanc_BC1!$H:$H,Lanc_BC1!$A:$A,\">=\"&G$5,Lanc_BC1!$A:$A,\"<\"&H$5,Lanc_BC1!$F:$F,\"=\"&$B9)","v":0},{"$f":"SUMIFS(Lanc_BC1!$H:$H,Lanc_BC1!$A:$A,\">=\"&H$5,Lanc_BC1!$A:$A,\"<\"&I$5,Lanc_BC1!$F:$F,\"=\"&$B9)","v":0},{"$f":"SUMIFS(Lanc_BC1!$H:$H,Lanc_BC1!$A:$A,\">=\"&I$5,Lanc_BC1!$A:$A,\"<\"&J$5,Lanc_BC1!$F:$F,\"=\"&$B9)","v":0},{"$f":"SUMIFS(Lanc_BC1!$H:$H,Lanc_BC1!$A:$A,\">=\"&J$5,Lanc_BC1!$A:$A,\"<\"&K$5,Lanc_BC1!$F:$F,\"=\"&$B9)","v":0},{"$f":"SUMIFS(Lanc_BC1!$H:$H,Lanc_BC1!$A:$A,\">=\"&K$5,Lanc_BC1!$A:$A,\"<\"&L$5,Lanc_BC1!$F:$F,\"=\"&$B9)","v":0},{"$f":"SUMIFS(Lanc_BC1!$H:$H,Lanc_BC1!$A:$A,\">=\"&L$5,Lanc_BC1!$A:$A,\"<\"&M$5,Lanc_BC1!$F:$F,\"=\"&$B9)","v":0},{"$f":"SUMIFS(Lanc_BC1!$H:$H,Lanc_BC1!$A:$A,\">=\"&M$5,Lanc_BC1!$A:$A,\"<\"&N$5,Lanc_BC1!$F:$F,\"=\"&$B9)","v":0},{"$f":"SUMIFS(Lanc_BC1!$H:$H,Lanc_BC1!$A:$A,\">=\"&N$5,Lanc_BC1!$A:$A,\"<\"&O$5,Lanc_BC1!$F:$F,\"=\"&$B9)","v":0},{"$f":"SUMIFS(#REF!,#REF!,\">=\"&O$5,#REF!,\"<\"&P$5,#REF!,\"=\"&$B9)","v":{"$error":"#REF!"}},{"$f":"SUM(C9:N9)","v":9640.4699999999993}]
[-2492,"Locação",{"$f":"SUMIFS(Lanc_BC1!$H:$H,Lanc_BC1!$A:$A,\">=\"&C$5,Lanc_BC1!$A:$A,\"<\"&D$5,Lanc_BC1!$F:$F,\"=\"&$B10)","v":-2492},{"$f":"SUMIFS(Lanc_BC1!$H:$H,Lanc_BC1!$A:$A,\">=\"&D$5,Lanc_BC1!$A:$A,\"<\"&E$5,Lanc_BC1!$F:$F,\"=\"&$B10)","v":0},{"$f":"SUMIFS(Lanc_BC1!$H:$H,Lanc_BC1!$A:$A,\">=\"&E$5,Lanc_BC1!$A:$A,\"<\"&F$5,Lanc_BC1!$F:$F,\"=\"&$B10)","v":0},{"$f":"SUMIFS(Lanc_BC1!$H:$H,Lanc_BC1!$A:$A,\">=\"&F$5,Lanc_BC1!$A:$A,\"<\"&G$5,Lanc_BC1!$F:$F,\"=\"&$B10)","v":0},{"$f":"SUMIFS(Lanc_BC1!$H:$H,Lanc_BC1!$A:$A,\">=\"&G$5,Lanc_BC1!$A:$A,\"<\"&H$5,Lanc_BC1!$F:$F,\"=\"&$B10)","v":0},{"$f":"SUMIFS(Lanc_BC1!$H:$H,Lanc_BC1!$A:$A,\">=\"&H$5,Lanc_BC1!$A:$A,\"<\"&I$5,Lanc_BC1!$F:$F,\"=\"&$B10)","v":0},{"$f":"SUMIFS(Lanc_BC1!$H:$H,Lanc_BC1!$A:$A,\">=\"&I$5,Lanc_BC1!$A:$A,\"<\"&J$5,Lanc_BC1!$F:$F,\"=\"&$B10)","v":0},{"$f":"SUMIFS(Lanc_BC1!$H:$H,Lanc_BC1!$A:$A,\">=\"&J$5,Lanc_BC1!$A:$A,\"<\"&K$5,Lanc_BC1!$F:$F,\"=\"&$B10)","v":0},{"$f":"SUMIFS(Lanc_BC1!$H:$H,Lanc_BC1!$A:$A,\">=\"&K$5,Lanc_BC1!$A:$A,\"<\"&L$5,Lanc_BC1!$F:$F,\"=\"&$B10)","v":0},{"$f":"SUMIFS(Lanc_BC1!$H:$H,Lanc_BC1!$A:$A,\">=\"&L$5,Lanc_BC1!$A:$A,\"<\"&M$5,Lanc_BC1!$F:$F,\"=\"&$B10)","v":0},{"$f":"SUMIFS(Lanc_BC1!$H:$H,Lanc_BC1!$A:$A,\">=\"&M$5,Lanc_BC1!$A:$A,\"<\"&N$5,Lanc_BC1!$F:$F,\"=\"&$B10)","v":0},{"$f":"SUMIFS(Lanc_BC1!$H:$H,Lanc_BC1!$A:$A,\">=\"&N$5,Lanc_BC1!$A:$A,\"<\"&O$5,Lanc_BC1!$F:$F,\"=\"&$B10)","v":0},{"$f":"SUMIFS(#REF!,#REF!,\">=\"&O$5,#REF!,\"<\"&P$5,#REF!,\"=\"&$B10)","v":{"$error":"#REF!"}},-2492]
{"$rows_left_out":156}
{"sheet":"BaseDados","index":6,"n_rows":198,"n_cols":10,"rows_kept":198,"cut":false,"hidden":true,"merged":[]}
[]
["Data          Pgto","Fornecedor/Cliente","Nº Doc","Descrição","Categoria","Banco","Valor               Pago      Recebido","Valor   Juros","Valor Desconto","Valor Original"]
["2022-01-03","Fernando Barrozo da S. Cardoso",null,null,"Locação","INTER",9948.4699999999993,0,0,{"$f":"G3-H3+I3","v":9948.4699999999993}]
["2022-01-03","Fernando Barrozo da S. Cardoso",null,null,"Locação","INTER",9948.4699999999993,0,0,{"$f":"G4-H4+I4","v":9948.4699999999993}]
["2022-01-03","Fernando Barrozo da S. Cardoso",null,null,"Locação","INTER",9948.4699999999993,0,0,9948.4699999999993]
["2022-01-03","Fernando Barrozo da S. Cardoso",null,null,"Locação","INTER",9948.4699999999993,0,0,9948.4699999999993]
["2022-01-03","Fernando Barrozo da S. Cardoso",null,null,"Locação","INTER",9948.4699999999993,0,0,9948.4699999999993]
["2022-01-03","Fernando Barrozo da S. Cardoso",null,null,"Locação","INTER",9948.4699999999993,0,0,9948.4699999999993]
["2022-01-03","Fernando Barrozo da S. Cardoso",null,null,"Locação","INTER",9948.4699999999993,0,0,9948.4699999999993]
["2022-01-03","Fernando Barrozo da S. Cardoso",null,null,"Locação","INTER",9948.4699999999993,0,0,9948.4699999999993]
{"$rows_left_out":188}